BDBM50299777 CHEMBL573761::N-(4-(6,7-dimethoxyquinolin-4-yloxy)-3-fluorophenyl)-2-oxo-3-phenylimidazolidine-1-carboxamide::Oxo-3-phenylimidazolidine-1-carboxamide, 2
SMILES COc1cc2nccc(Oc3ccc(NC(=O)N4CCN(C4=O)c4ccccc4)cc3F)c2cc1OC
InChI Key InChIKey=MCTIWUDXKBCHRY-UHFFFAOYSA-N
Data  1 KI  7 IC50
  Tab Delimited (TSV)   2D SDfile   Computed 3D by Vconf -m prep SDfile
Find this compound or compounds like it in BindingDB:
Activity Spreadsheet -- Enzyme Inhibition Constant Data from BindingDB
Found 8 hits for monomerid = 50299777
TargetHepatocyte growth factor receptor(Homo sapiens (Human))
Amgen
Curated by ChEMBL
LigandPNGBDBM50299777(CHEMBL573761 | N-(4-(6,7-dimethoxyquinolin-4-yloxy...)
Affinity DataKi:  1.70nM. Assay description: Inhibition of recombinant c-met-mediated gastrin phosphorylation by HTRF assay
In DepthDetails ArticlePubMed
TargetHepatocyte growth factor receptor(Homo sapiens (Human))
Amgen
Curated by ChEMBL
LigandPNGBDBM50299777(CHEMBL573761 | N-(4-(6,7-dimethoxyquinolin-4-yloxy...)
Affinity DataIC50:  10nM. Assay description: Inhibition assay using kinase inhibitors.
In DepthDetails
TargetHepatocyte growth factor receptor(Homo sapiens (Human))
Amgen
Curated by ChEMBL
LigandPNGBDBM50299777(CHEMBL573761 | N-(4-(6,7-dimethoxyquinolin-4-yloxy...)
Affinity DataIC50:  30nM. Assay description: Inhibition of GST-tagged c-Met expressed in Sf9 cells
In DepthDetails ArticlePubMed
TargetHepatocyte growth factor receptor(Homo sapiens (Human))
Amgen
Curated by ChEMBL
LigandPNGBDBM50299777(CHEMBL573761 | N-(4-(6,7-dimethoxyquinolin-4-yloxy...)
Affinity DataIC50:  53nM. Assay description: Inhibition of HGF-mediated c-met autophosphorylation in serum-starved human PC3 cells after 1 hr by electrochemiluminescent immunoassay
In DepthDetails ArticlePubMed
TargetHepatocyte growth factor receptor(Homo sapiens (Human))
Amgen
Curated by ChEMBL
LigandPNGBDBM50299777(CHEMBL573761 | N-(4-(6,7-dimethoxyquinolin-4-yloxy...)
Affinity DataIC50:  80nM. Assay description: Inhibition of c-Met in human DU145 cells assessed as cell scattering
In DepthDetails ArticlePubMed
TargetHepatocyte growth factor receptor(Homo sapiens (Human))
Amgen
Curated by ChEMBL
LigandPNGBDBM50299777(CHEMBL573761 | N-(4-(6,7-dimethoxyquinolin-4-yloxy...)
Affinity DataIC50:  90nM. Assay description: Inhibition of TPR-Met assessed as autophosphorylation
In DepthDetails ArticlePubMed
TargetHepatocyte growth factor receptor(Homo sapiens (Human))
Amgen
Curated by ChEMBL
LigandPNGBDBM50299777(CHEMBL573761 | N-(4-(6,7-dimethoxyquinolin-4-yloxy...)
Affinity DataIC50:  30nM. Assay description: Inhibition assay using kinase inhibitors.
In DepthDetails
TargetHepatocyte growth factor receptor(Homo sapiens (Human))
Amgen
Curated by ChEMBL
LigandPNGBDBM50299777(CHEMBL573761 | N-(4-(6,7-dimethoxyquinolin-4-yloxy...)
Affinity DataIC50:  80nM. Assay description: Inhibition of c-Met in human A549 cells by wound healing assay
In DepthDetails ArticlePubMed