BDBM50301619 (S)-3-((S)-1-(4-(5-(2-aminopyrimidin-4-yl)-1H-benzo[d]imidazol-1-yl)pyrimidin-2-ylamino)ethyl)-4-methyl-N-(naphthalen-1-yl)piperazine-1-carboxamide::CHEMBL566284
SMILES C[C@H](Nc1nccc(n1)-n1cnc2cc(ccc12)-c1ccnc(N)n1)[C@@H]1CN(CCN1C)C(=O)Nc1cccc2ccccc12
InChI Key InChIKey=SYZWSAWHGVKMHW-LGGPFLRQSA-N
Data  1 IC50
  Tab Delimited (TSV)   2D SDfile   Computed 3D by Vconf -m prep SDfile
Find this compound or compounds like it in BindingDB:
Activity Spreadsheet -- Enzyme Inhibition Constant Data from BindingDB
Found 1 hit for monomerid = 50301619
TargetTyrosine-protein kinase Lck(Homo sapiens (Human))
Merck Research Laboratories
Curated by ChEMBL
LigandPNGBDBM50301619((S)-3-((S)-1-(4-(5-(2-aminopyrimidin-4-yl)-1H-benz...)
Affinity DataIC50:  0.0700nM. Assay description: Inhibition of Lck
In DepthDetails ArticlePubMed