BDBM50301929 4-amino-5-chloro-N-((3S,4R)-1-(((1S,2S)-2-hydroxy-2-(3-methoxyphenyl)cyclohexyl)methyl)-3-methoxypiperidin-4-yl)-2-methoxybenzamide::CHEMBL571799
SMILES CO[C@H]1CN(C[C@@H]2CCCC[C@@]2(O)c2cccc(OC)c2)CC[C@H]1NC(=O)c1cc(Cl)c(N)cc1OC
InChI Key InChIKey=POJMJIIKSJRQPV-QZOFJNMOSA-N
Data  3 IC50  2 EC50
  Tab Delimited (TSV)   2D SDfile   Computed 3D by Vconf -m prep SDfile
Find this compound or compounds like it in BindingDB:
Activity Spreadsheet -- Enzyme Inhibition Constant Data from BindingDB
Found 5 hits for monomerid = 50301929
TargetMu-type opioid receptor(Homo sapiens (Human))
Sepracor
Curated by ChEMBL
LigandPNGBDBM50301929(4-amino-5-chloro-N-((3S,4R)-1-(((1S,2S)-2-hydroxy-...)
Affinity DataIC50: >1.00E+4nM. Assay description: Binding affinity to human mu opioid receptor
In DepthDetails ArticlePubMed
Target5-hydroxytryptamine receptor 4(Homo sapiens (Human))
Sepracor
Curated by ChEMBL
LigandPNGBDBM50301929(4-amino-5-chloro-N-((3S,4R)-1-(((1S,2S)-2-hydroxy-...)
Affinity DataEC50:  120nM. Assay description: Agonist activity at human recombinant 5-HT4 receptor
In DepthDetails ArticlePubMed
Target5-hydroxytryptamine receptor 4(Homo sapiens (Human))
Sepracor
Curated by ChEMBL
LigandPNGBDBM50301929(4-amino-5-chloro-N-((3S,4R)-1-(((1S,2S)-2-hydroxy-...)
Affinity DataIC50:  3.90E+3nM. Assay description: Displacement of [3H]GR-113808 from human recombinant 5-HT4 receptor
In DepthDetails ArticlePubMed
Target5-hydroxytryptamine receptor 3A(Homo sapiens (Human))
Sepracor
Curated by ChEMBL
LigandPNGBDBM50301929(4-amino-5-chloro-N-((3S,4R)-1-(((1S,2S)-2-hydroxy-...)
Affinity DataIC50:  159nM. Assay description: Displacement of [3H]granisetron from human recombinant 5-HT3 receptor expressed in HEK293 cells
In DepthDetails ArticlePubMed
Target5-hydroxytryptamine receptor 3A(Homo sapiens (Human))
Sepracor
Curated by ChEMBL
LigandPNGBDBM50301929(4-amino-5-chloro-N-((3S,4R)-1-(((1S,2S)-2-hydroxy-...)
Affinity DataEC50: >1.00E+4nM. Assay description: Antagonist activity at human recombinant 5-HT3 receptor expressed in HEK293 cells
In DepthDetails ArticlePubMed