BDBM50303178 5-((5-(4-nitrophenyl)furan-2-yl)methylene)-4-thioxothiazolidin-2-one::CHEMBL565802
SMILES OC1=NC(=S)C(S1)=Cc1ccc(o1)-c1ccc(cc1)[N+]([O-])=O
InChI Key InChIKey=NYGLSIBLLIHMHR-UHFFFAOYSA-N
Data  1 KI
  Tab Delimited (TSV)   2D SDfile   Computed 3D by Vconf -m prep SDfile
Find this compound or compounds like it in BindingDB:
Activity Spreadsheet -- Enzyme Inhibition Constant Data from BindingDB
Found 1 hit for monomerid = 50303178
TargetDual specificity protein phosphatase 3(Homo sapiens (Human))
Institute For Medical Research
Curated by ChEMBL
LigandPNGBDBM50303178(5-((5-(4-nitrophenyl)furan-2-yl)methylene)-4-thiox...)
Affinity DataKi:  1.86E+3nM. Assay description: Inhibition of recombinant vaccina H1-related phosphatase expressed in Escherichia coli by Michaelis-Menton kinetic studies
In DepthDetails ArticlePubMed