BDBM50305335 7-hydroxy-4-((6-methylpyridin-2-ylthio)methyl)-2H-chromen-2-one::CHEMBL589158
SMILES Cc1cccc(SCc2cc(=O)oc3cc(O)ccc23)n1
InChI Key InChIKey=DCLGJKYZQBEHEE-UHFFFAOYSA-N
Data  3 IC50
  Tab Delimited (TSV)   2D SDfile   Computed 3D by Vconf -m prep SDfile
Find this compound or compounds like it in BindingDB:
Activity Spreadsheet -- Enzyme Inhibition Constant Data from BindingDB
Found 3 hits for monomerid = 50305335
Target17-beta-hydroxysteroid dehydrogenase type 3(Homo sapiens (Human))
Sumitomo Chemical
Curated by ChEMBL
LigandPNGBDBM50305335(7-hydroxy-4-((6-methylpyridin-2-ylthio)methyl)-2H-...)
Affinity DataIC50:  1.5nM. Assay description: Inhibition of human 17beta-HSD3 expressed in HeLa cells
In DepthDetails ArticlePubMed
TargetEstrogen receptor(Homo sapiens (Human))
Sumitomo Chemical
Curated by ChEMBL
LigandPNGBDBM50305335(7-hydroxy-4-((6-methylpyridin-2-ylthio)methyl)-2H-...)
Affinity DataIC50:  5.00E+4nM. Assay description: Agonist activity at ER by reporter gene assay
In DepthDetails ArticlePubMed
TargetAndrogen receptor(Homo sapiens (Human))
Sumitomo Chemical
Curated by ChEMBL
LigandPNGBDBM50305335(7-hydroxy-4-((6-methylpyridin-2-ylthio)methyl)-2H-...)
Affinity DataIC50:  5.00E+4nM. Assay description: Antagonist activity at AR by reporter gene assay
In DepthDetails ArticlePubMed