BDBM50306323 CHEMBL600986::N-((6aS,13bR)-11-chloro-12-hydroxy-7-methyl-6,6a,7,8,9,13b-hexahydro-5H-benzo[d]naphtho[2,1-b]azepin-3-yl)ethanesulfonamide
SMILES CCS(=O)(=O)Nc1ccc2[C@H]3[C@H](CCc2c1)N(C)CCc1cc(Cl)c(O)cc31
InChI Key InChIKey=FQUQVJCZFGUICL-PZJWPPBQSA-N
Data  4 KI
  Tab Delimited (TSV)   2D SDfile   Computed 3D by Vconf -m prep SDfile
Find this compound or compounds like it in BindingDB:
Activity Spreadsheet -- Enzyme Inhibition Constant Data from BindingDB
Found 4 hits for monomerid = 50306323
TargetD(1A) dopamine receptor(Homo sapiens (Human))
Merck Research Laboratories
Curated by ChEMBL
LigandPNGBDBM50306323(CHEMBL600986 | N-((6aS,13bR)-11-chloro-12-hydroxy-...)
Affinity DataKi:  0.700nM. Assay description: Binding affinity to dopamine D1 receptor
In DepthDetails ArticlePubMed
TargetD(1B) dopamine receptor(Homo sapiens (Human))
Merck Research Laboratories
Curated by ChEMBL
LigandPNGBDBM50306323(CHEMBL600986 | N-((6aS,13bR)-11-chloro-12-hydroxy-...)
Affinity DataKi:  5.60nM. Assay description: Binding affinity to dopamine D5 receptor
In DepthDetails ArticlePubMed
TargetD(2) dopamine receptor(Homo sapiens (Human))
Merck Research Laboratories
Curated by ChEMBL
LigandPNGBDBM50306323(CHEMBL600986 | N-((6aS,13bR)-11-chloro-12-hydroxy-...)
Affinity DataKi:  3.30E+3nM. Assay description: Binding affinity to dopamine D2 receptor
In DepthDetails ArticlePubMed
TargetD(4) dopamine receptor(Homo sapiens (Human))
Merck Research Laboratories
Curated by ChEMBL
LigandPNGBDBM50306323(CHEMBL600986 | N-((6aS,13bR)-11-chloro-12-hydroxy-...)
Affinity DataKi: >1.00E+4nM. Assay description: Binding affinity to dopamine D4 receptor
In DepthDetails ArticlePubMed