BDBM50306586 (R)-3-(4-(benzyloxy)phenyl)-2-(carboxyformamido)propanoic acid::CHEMBL591689::O-benzyl-N-(carboxycarbonyl)-D-tyrosine
SMILES OC(=O)[C@@H](Cc1ccc(OCc2ccccc2)cc1)NC(=O)C(O)=O
InChI Key InChIKey=XBNMVIZFMMWMFD-OAHLLOKOSA-N
Data  1 IC50
PDB links: 1 PDB ID matches this monomer.
  Tab Delimited (TSV)   2D SDfile   Computed 3D by Vconf -m prep SDfile
Find this compound or compounds like it in BindingDB:
Activity Spreadsheet -- Enzyme Inhibition Constant Data from BindingDB
Found 1 hit for monomerid = 50306586
TargetLysine-specific demethylase 4A(Homo sapiens (Human))
University Of Oxford
Curated by ChEMBL
LigandPNGBDBM50306586((R)-3-(4-(benzyloxy)phenyl)-2-(carboxyformamido)pr...)
Affinity DataIC50:  3.30E+4nM. Assay description: Inhibition of JMJD2A by MALDI-TOF assay