BDBM50306735 1-methylethyl 8-fluoro-1,1-dimethyl-3-{[4-(3-morpholin-4-ylpropoxy)phenyl]carbonyl}-1,2,3,6-tetrahydroazepino[4,5-b]indole-5-carboxylate::CHEMBL589766::Isopropyl 8-Fluoro-1,1-dimethyl-3-[4-(3-morpholin-4-ylpropoxy)-benzoyl]-1,2,3,6-tetrahydroazepino[4,5-b]indole-5-carboxylate
SMILES CC(C)OC(=O)C1=CN(CC(C)(C)c2c1[nH]c1cc(F)ccc21)C(=O)c1ccc(OCCCN2CCOCC2)cc1
InChI Key InChIKey=PIVQVFFIZHFKHL-UHFFFAOYSA-N
Data  1 IC50  2 EC50
PDB links: 1 PDB ID matches this monomer.
  Tab Delimited (TSV)   2D SDfile   Computed 3D by Vconf -m prep SDfile
Find this compound or compounds like it in BindingDB:
Activity Spreadsheet -- Enzyme Inhibition Constant Data from BindingDB
Found 3 hits for monomerid = 50306735
TargetBile acid receptor(Homo sapiens (Human))
Wyeth Research
Curated by ChEMBL
LigandPNGBDBM50306735(1-methylethyl 8-fluoro-1,1-dimethyl-3-{[4-(3-morph...)
Affinity DataEC50:  88nM. Assay description: Agonist activity at human FXR-LBD expressed in HEL293 cells by Gal4-luciferase assay
TargetPotassium voltage-gated channel subfamily H member 2(Homo sapiens (Human))
Wyeth Research
Curated by ChEMBL
LigandPNGBDBM50306735(1-methylethyl 8-fluoro-1,1-dimethyl-3-{[4-(3-morph...)
Affinity DataIC50: >3.00E+4nM. Assay description: Inhibition of human ERG
In DepthDetails ArticlePubMed
TargetBile acid receptor(Mus musculus)
Wyeth Research
Curated by ChEMBL
LigandPNGBDBM50306735(1-methylethyl 8-fluoro-1,1-dimethyl-3-{[4-(3-morph...)
Affinity DataEC50:  52nM. Assay description: Agonist activity at mouse FXR-LBD expressed in HEL293 cells by Gal4-luciferase assay