BDBM50307812 1-[3-(4-Bromo-2-methyl-2Hpyrazol-3-yl)-4-methoxyphenyl]-3-(4-chlorophenyl)urea::CHEMBL591223
SMILES COc1ccc(NC(=O)Nc2ccc(Cl)cc2)cc1-c1c(Br)cnn1C
InChI Key InChIKey=OLSNXEOXWIBURX-UHFFFAOYSA-N
Data  1 EC50
  Tab Delimited (TSV)   2D SDfile   Computed 3D by Vconf -m prep SDfile
Find this compound or compounds like it in BindingDB:
Activity Spreadsheet -- Enzyme Inhibition Constant Data from BindingDB
Found 1 hit for monomerid = 50307812
Target5-hydroxytryptamine receptor 2A(Homo sapiens (Human))
Arena Pharmaceuticals
Curated by ChEMBL
LigandPNGBDBM50307812(1-[3-(4-Bromo-2-methyl-2Hpyrazol-3-yl)-4-methoxyph...)
Affinity DataEC50:  0.700nM. Assay description: Activity at human 5HT2A receptor expressed in HEK293 cells assessed as [3H]inositol phosphate production by scintillation counting
In DepthDetails ArticlePubMed