BDBM50308983 2-(4-bromo-2-(4-(carboxymethoxy)benzoyl)phenoxy)acetic acid::CHEMBL597113
SMILES OC(=O)COc1ccc(cc1)C(=O)c1cc(Br)ccc1OCC(O)=O
InChI Key InChIKey=PTQLZKRWKHXUJU-UHFFFAOYSA-N
Data  1 IC50
  Tab Delimited (TSV)   2D SDfile   Computed 3D by Vconf -m prep SDfile
Find this compound or compounds like it in BindingDB:
Activity Spreadsheet -- Enzyme Inhibition Constant Data from BindingDB
Found 1 hit for monomerid = 50308983
TargetDNA (cytosine-5)-methyltransferase 1(Homo sapiens (Human))
Deutsches Krebsforschungszentrum
Curated by ChEMBL
LigandPNGBDBM50308983(2-(4-bromo-2-(4-(carboxymethoxy)benzoyl)phenoxy)ac...)
Affinity DataIC50:  2.12E+5nM. Assay description: Inhibition of human recombinant DNMT1 expressed in baculovirus-insect cell system by scintillation counting
In DepthDetails ArticlePubMed