BDBM50310475 (2-(4-amino-1,2,5-oxadiazol-3-yl)-1-cyclobutyl-1H-benzo[d]imidazol-5-yl)methanol::CHEMBL1080970
SMILES Nc1nonc1-c1nc2cc(CO)ccc2n1C1CCC1
InChI Key InChIKey=WMPGRCGEFQMAES-UHFFFAOYSA-N
Data  4 KI
  Tab Delimited (TSV)   2D SDfile   Computed 3D by Vconf -m prep SDfile
Find this compound or compounds like it in BindingDB:
Activity Spreadsheet -- Enzyme Inhibition Constant Data from BindingDB
Found 4 hits for monomerid = 50310475
TargetRibosomal protein S6 kinase beta-1(Homo sapiens (Human))
Vertex Pharmaceuticals
Curated by ChEMBL
LigandPNGBDBM50310475((2-(4-amino-1,2,5-oxadiazol-3-yl)-1-cyclobutyl-1H-...)
Affinity DataKi:  16nM. Assay description: Inhibition of p70S6K assessed as decrease in NADH absorbance at 340 nm in the presence of
In DepthDetails ArticlePubMed
TargetcAMP-dependent protein kinase catalytic subunit alpha(Homo sapiens (Human))
Vertex Pharmaceuticals
Curated by ChEMBL
LigandPNGBDBM50310475((2-(4-amino-1,2,5-oxadiazol-3-yl)-1-cyclobutyl-1H-...)
Affinity DataKi:  1.50E+3nM. Assay description: Inhibition of PKAalpha assessed as decrease in NADH absorbance at 340 nm in the presence of
In DepthDetails ArticlePubMed
TargetGlycogen synthase kinase-3 beta(Homo sapiens (Human))
Vertex Pharmaceuticals
Curated by ChEMBL
LigandPNGBDBM50310475((2-(4-amino-1,2,5-oxadiazol-3-yl)-1-cyclobutyl-1H-...)
Affinity DataKi: >3.30E+3nM. Assay description: Inhibition of GSK3beta assessed as decrease in NADH absorbance at 340 nm in the presence of
In DepthDetails ArticlePubMed
TargetRho-associated protein kinase 1(Homo sapiens (Human))
Vertex Pharmaceuticals
Curated by ChEMBL
LigandPNGBDBM50310475((2-(4-amino-1,2,5-oxadiazol-3-yl)-1-cyclobutyl-1H-...)
Affinity DataKi: >3.30E+3nM. Assay description: Inhibition of ROCK1 assessed as decrease in NADH absorbance at 340 nm in the presence of
In DepthDetails ArticlePubMed