BDBM50310879 CHEMBL1077669::N,N'-(9-oxo-9,9a-dihydroacridine-2,6-diyl)bis(3-(2-(2-hydroxyethyl)piperidin-1-yl)propanamide)
SMILES OCCC1CCCCN1CCC(=O)Nc1ccc2c(O)c3cc(NC(=O)CCN4CCCCC4CCO)ccc3nc2c1
InChI Key InChIKey=JCDJTQVXTSHHLI-UHFFFAOYSA-N
Data  1 IC50
  Tab Delimited (TSV)   2D SDfile   Computed 3D by Vconf -m prep SDfile
Find this compound or compounds like it in BindingDB:
Activity Spreadsheet -- Enzyme Inhibition Constant Data from BindingDB
Found 1 hit for monomerid = 50310879
TargetTelomerase reverse transcriptase(Homo sapiens (Human))
Central University Of Las Villas
Curated by ChEMBL
LigandPNGBDBM50310879(CHEMBL1077669 | N,N'-(9-oxo-9,9a-dihydroacridine-2...)
Affinity DataIC50:  200nM. Assay description: Inhibition of telomerase in human A2780 cells by TRAP assay
In DepthDetails ArticlePubMed