BDBM50311847 2-(3-(2-(2-hydroxy-5-nitrobenzoyl)hydrazono)-2-oxoindolin-1-yl)-N-p-tolylacetamide::CHEMBL1080295::cid_5758016
SMILES Cc1ccc(NC(=O)CN2C(=O)C(=NNC(=O)c3cc(ccc3O)[N+]([O-])=O)c3ccccc23)cc1
InChI Key InChIKey=VSKNCRWEPCCMFA-UHFFFAOYSA-N
Data  4 IC50
  Tab Delimited (TSV)   2D SDfile   Computed 3D by Vconf -m prep SDfile
Find this compound or compounds like it in BindingDB:
Activity Spreadsheet -- Enzyme Inhibition Constant Data from BindingDB
Found 4 hits for monomerid = 50311847
TargetDual specificity protein phosphatase 6(Rattus norvegicus)
Sanford-Burnham Center For Chemical Genomics
Curated by PubChem BioAssay
LigandPNGBDBM50311847(2-(3-(2-(2-hydroxy-5-nitrobenzoyl)hydrazono)-2-oxo...)
Affinity DataIC50:  3.10E+4nM. Assay description: Data Source: Sanford-Burnham Center for Chemical Genomics (SBCCG) Source Affiliation: Sanford-Burnham Medical Research Institute (SBMRI, San Diego, C...
In DepthDetails PCBioAssay
TargetBeta-secretase 1(Homo sapiens (Human))
University Of Leeds
Curated by ChEMBL
LigandPNGBDBM50311847(2-(3-(2-(2-hydroxy-5-nitrobenzoyl)hydrazono)-2-oxo...)
Affinity DataIC50:  2.40E+3nM. Assay description: Inhibition of human recombinant BACE1 at 100 uM
In DepthDetails ArticlePubMed
TargetDual specificity protein phosphatase 3(Homo sapiens (Human))
Burnham Center For Chemical Genomics
Curated by PubChem BioAssay
LigandPNGBDBM50311847(2-(3-(2-(2-hydroxy-5-nitrobenzoyl)hydrazono)-2-oxo...)
Affinity DataIC50:  1.29E+4nM. Assay description: Data Source: Sanford-Burnham Center for Chemical Genomics (SBCCG) Source Affiliation: Sanford-Burnham Medical Research Institute (SBMRI, San Diego, C...
In DepthDetails PCBioAssay
TargetDual specificity protein phosphatase 3(Homo sapiens (Human))
Burnham Center For Chemical Genomics
Curated by PubChem BioAssay
LigandPNGBDBM50311847(2-(3-(2-(2-hydroxy-5-nitrobenzoyl)hydrazono)-2-oxo...)
Affinity DataIC50:  6.94E+3nM. Assay description: Data Source: Sanford-Burnham Center for Chemical Genomics (SBCCG) Source Affiliation: Sanford-Burnham Medical Research Institute (SBMRI, San Diego, C...
In DepthDetails PCBioAssay