BDBM50313185 1,3alpha,8-trimethyl-1,2,3,3alpha,8,8alpha-hexahydropyrrolo[2,3-b]indol-5-yl-3-chlorophenylcarbamate::CHEMBL1081300
SMILES CN1CC[C@]2(C)[C@H]1N(C)c1ccc(OC(=O)Nc3cccc(Cl)c3)cc21
InChI Key InChIKey=ZNXQOPMLFXVWJX-QUCCMNQESA-N
Data  2 IC50
  Tab Delimited (TSV)   2D SDfile   Computed 3D by Vconf -m prep SDfile
Find this compound or compounds like it in BindingDB:
Activity Spreadsheet -- Enzyme Inhibition Constant Data from BindingDB
Found 2 hits for monomerid = 50313185
TargetCarboxylic ester hydrolase(Rattus norvegicus (rat))
Zhejiang University
Curated by ChEMBL
LigandPNGBDBM50313185(1,3alpha,8-trimethyl-1,2,3,3alpha,8,8alpha-hexahyd...)
Affinity DataIC50:  105nM. Assay description: Inhibition of rat plasma BChE by Ellman's method
In DepthDetails ArticlePubMed
TargetAcetylcholinesterase(Rattus norvegicus (rat))
Zhejiang University
Curated by ChEMBL
LigandPNGBDBM50313185(1,3alpha,8-trimethyl-1,2,3,3alpha,8,8alpha-hexahyd...)
Affinity DataIC50:  38.7nM. Assay description: Inhibition of rat brain AChE by Ellman's method
In DepthDetails ArticlePubMed