BDBM50318490 7-((1S,2S)-2-((S)-3-hydroxyoct-1-enyl)-5-oxocyclopent-3-enyl)hept-5-enoic acid::CHEMBL1083802
SMILES CCCCC[C@H](O)C=C[C@H]1C=CC(=O)[C@H]1C\C=C/CCCC(O)=O
InChI Key InChIKey=MYHXHCUNDDAEOZ-VWZZFDNBSA-N
Data  1 EC50
  Tab Delimited (TSV)   2D SDfile   Computed 3D by Vconf -m prep SDfile
Find this compound or compounds like it in BindingDB:
Activity Spreadsheet -- Enzyme Inhibition Constant Data from BindingDB
Found 1 hit for monomerid = 50318490
TargetTransient receptor potential cation channel subfamily A member 1(Homo sapiens (Human))
Ferrara University
Curated by ChEMBL
LigandPNGBDBM50318490(7-((1S,2S)-2-((S)-3-hydroxyoct-1-enyl)-5-oxocyclop...)
Affinity DataEC50:  2.24E+4nM. Assay description: Activation of TRPA1 channel
In DepthDetails ArticlePubMed