BDBM50320388 CHEMBL1083627::polysin
SMILES C[C@@]12CC[C@H]3C(C)(C)C(=O)CC[C@]3(C)[C@@H]1Cc1cc3ccccc3n21
InChI Key InChIKey=NEPLKJAINOWIJL-DHNNRRLOSA-N
Data  1 KI
  Tab Delimited (TSV)   2D SDfile   Computed 3D by Vconf -m prep SDfile
Find this compound or compounds like it in BindingDB:
Activity Spreadsheet -- Enzyme Inhibition Constant Data from BindingDB
Found 1 hit for monomerid = 50320388
TargetATP-dependent 6-phosphofructokinase(Trypanosoma brucei)
University Of Yaound£
Curated by ChEMBL
LigandPNGBDBM50320388(CHEMBL1083627 | polysin)
Affinity DataKi:  9.00E+3nM. Assay description: Competitive reversible inhibition of Trypanosoma brucei PFK expressed in Escherichia coli using fructose-6-phosphate by spectrophotometry analysis
In DepthDetails ArticlePubMed