BDBM50327336 2-(3-methyl-4-(quinoxalin-6-yl)-1-o-tolyl-1H-pyrazol-5-ylamino)benzoic acid::CHEMBL1258396
SMILES Cc1nn(c(Nc2ccccc2C(O)=O)c1-c1ccc2nccnc2c1)-c1ccccc1C
InChI Key InChIKey=KUJFUTJUYANNOM-UHFFFAOYSA-N
Data  3 IC50
  Tab Delimited (TSV)   2D SDfile   Computed 3D by Vconf -m prep SDfile
Find this compound or compounds like it in BindingDB:
Activity Spreadsheet -- Enzyme Inhibition Constant Data from BindingDB
Found 3 hits for monomerid = 50327336
TargetAdenosine receptor A1(Homo sapiens (Human))
Bayer Schering Pharma
Curated by ChEMBL
LigandPNGBDBM50327336(2-(3-methyl-4-(quinoxalin-6-yl)-1-o-tolyl-1H-pyraz...)
Affinity DataIC50:  8nM. Assay description: Antagonist activity at adenosine A1 receptor by cAMP assay
In DepthDetails ArticlePubMed
TargetAdenosine receptor A2b(Homo sapiens (Human))
Bayer Schering Pharma
Curated by ChEMBL
LigandPNGBDBM50327336(2-(3-methyl-4-(quinoxalin-6-yl)-1-o-tolyl-1H-pyraz...)
Affinity DataIC50: >5.00E+4nM. Assay description: Antagonist activity at adenosine A2B receptor by cAMP assay
In DepthDetails ArticlePubMed
TargetAdenosine receptor A2a(Homo sapiens (Human))
Bayer Schering Pharma
Curated by ChEMBL
LigandPNGBDBM50327336(2-(3-methyl-4-(quinoxalin-6-yl)-1-o-tolyl-1H-pyraz...)
Affinity DataIC50: >5.00E+4nM. Assay description: Antagonist activity at adenosine A2A receptor by cAMP assay
In DepthDetails ArticlePubMed