BDBM50330613 CHEMBL1277386::N-(4-Bromo-2-fluorobenzyl)-N-(3,5-difluoro-4-hydroxyphenyl)-benzenesulfonamide
SMILES Oc1c(F)cc(cc1F)N(Cc1ccc(Br)cc1F)S(=O)(=O)c1ccccc1
InChI Key InChIKey=CSFHAEWVRGIARV-UHFFFAOYSA-N
Data  2 IC50
  Tab Delimited (TSV)   2D SDfile   Computed 3D by Vconf -m prep SDfile
Find this compound or compounds like it in BindingDB:
Activity Spreadsheet -- Enzyme Inhibition Constant Data from BindingDB
Found 2 hits for monomerid = 50330613
TargetAldo-keto reductase family 1 member B1(Rattus norvegicus)
Aristotle University Of Thessaloniki
Curated by ChEMBL
LigandPNGBDBM50330613(CHEMBL1277386 | N-(4-Bromo-2-fluorobenzyl)-N-(3,5-...)
Affinity DataIC50:  5.70E+3nM. Assay description: Inhibition of Fischer-344 rat lens ALR2 by least-square analysis
In DepthDetails ArticlePubMed
TargetAldo-keto reductase family 1 member A1(Rattus norvegicus)
Aristotle University Of Thessaloniki
Curated by ChEMBL
LigandPNGBDBM50330613(CHEMBL1277386 | N-(4-Bromo-2-fluorobenzyl)-N-(3,5-...)
Affinity DataIC50:  1.19E+4nM. Assay description: Inhibition of Fischer-344 rat kidney AK1A1
In DepthDetails ArticlePubMed