BDBM50331735 2-((R)-6-fluoro-8-(methylsulfonyl)-9-((S)-1-phenylethyl)-2,3,4,9-tetrahydro-1H-carbazol-1-yl)acetic acid::CHEMBL1290298
SMILES C[C@@H](c1ccccc1)n1c2[C@@H](CC(O)=O)CCCc2c2cc(F)cc(c12)S(C)(=O)=O
InChI Key InChIKey=AIULETPMIOZKLN-GOEBONIOSA-N
Data  2 KI
  Tab Delimited (TSV)   2D SDfile   Computed 3D by Vconf -m prep SDfile
Find this compound or compounds like it in BindingDB:
Activity Spreadsheet -- Enzyme Inhibition Constant Data from BindingDB
Found 2 hits for monomerid = 50331735
TargetProstaglandin D2 receptor(Homo sapiens (Human))
Merck Frosst Centre For Therapeutic Research
Curated by ChEMBL
LigandPNGBDBM50331735(2-((R)-6-fluoro-8-(methylsulfonyl)-9-((S)-1-phenyl...)
Affinity DataKi:  0.360nM. Assay description: Antagonist activity at prostanoid DP1 receptor
In DepthDetails ArticlePubMed
TargetThromboxane A2 receptor(Homo sapiens (Human))
Merck Frosst Centre For Therapeutic Research
Curated by ChEMBL
LigandPNGBDBM50331735(2-((R)-6-fluoro-8-(methylsulfonyl)-9-((S)-1-phenyl...)
Affinity DataKi:  362nM. Assay description: Antagonist activity at prostanoid TP receptor
In DepthDetails ArticlePubMed