BDBM50331839 CHEMBL1288882::N-(5-(trifluoromethyl)-1,3,4-thiadiazol-2-yl)acetamide
SMILES CC(=O)Nc1nnc(s1)C(F)(F)F
InChI Key InChIKey=AUAGFVGIYFHJAO-UHFFFAOYSA-N
Data  1 IC50
  Tab Delimited (TSV)   2D SDfile   Computed 3D by Vconf -m prep SDfile
Find this compound or compounds like it in BindingDB:
Activity Spreadsheet -- Enzyme Inhibition Constant Data from BindingDB
Found 1 hit for monomerid = 50331839
TargetEndochitinase A1(Neosartorya fumigata (Aspergillus fumigatus))
University Of Dundee
Curated by ChEMBL
LigandPNGBDBM50331839(CHEMBL1288882 | N-(5-(trifluoromethyl)-1,3,4-thiad...)
Affinity DataIC50:  1.41E+5nM. Assay description: Inhibition of Aspergillus fumigatus ChiA1 expressed in Pichia pastoris after 70 mins
In DepthDetails ArticlePubMed