BDBM50331844 2,2,2-trifluoro-N-(5-morpholino-1,3,4-thiadiazol-2-yl)acetamide::CHEMBL1288929
SMILES FC(F)(F)C(=O)Nc1nnc(s1)N1CCOCC1
InChI Key InChIKey=XBDOVSVKAXDFSJ-UHFFFAOYSA-N
Data  1 IC50
  Tab Delimited (TSV)   2D SDfile   Computed 3D by Vconf -m prep SDfile
Find this compound or compounds like it in BindingDB:
Activity Spreadsheet -- Enzyme Inhibition Constant Data from BindingDB
Found 1 hit for monomerid = 50331844
TargetEndochitinase A1(Neosartorya fumigata (Aspergillus fumigatus))
University Of Dundee
Curated by ChEMBL
LigandPNGBDBM50331844(2,2,2-trifluoro-N-(5-morpholino-1,3,4-thiadiazol-2...)
Affinity DataIC50: >1.00E+6nM. Assay description: Inhibition of Aspergillus fumigatus ChiA1 expressed in Pichia pastoris after 70 mins
In DepthDetails ArticlePubMed