BDBM50332780 7-Hydroxy-acridine-4-carboxylic acid (2-dimethylamino-ethyl)-amide::CHEMBL56149::N-(2-(dimethylamino)ethyl)-7-hydroxyacridine-4-carboxamide
SMILES CN(C)CCNC(=O)c1cccc2cc3cc(O)ccc3nc12
InChI Key InChIKey=WHIXILDYJOJOPD-UHFFFAOYSA-N
Data  2 IC50
  Tab Delimited (TSV)   2D SDfile   Computed 3D by Vconf -m prep SDfile
Find this compound or compounds like it in BindingDB:
Activity Spreadsheet -- Enzyme Inhibition Constant Data from BindingDB
Found 2 hits for monomerid = 50332780
TargetAldehyde oxidase 1(Rattus norvegicus)
Pfizer
Curated by ChEMBL
LigandPNGBDBM50332780(7-Hydroxy-acridine-4-carboxylic acid (2-dimethylam...)
Affinity DataIC50:  320nM. Assay description: Inhibition of rat aldehyde oxidase
In DepthDetails ArticlePubMed
TargetAldehyde oxidase(Homo sapiens (Human))
Pfizer
Curated by ChEMBL
LigandPNGBDBM50332780(7-Hydroxy-acridine-4-carboxylic acid (2-dimethylam...)
Affinity DataIC50:  40nM. Assay description: Inhibition of human aldehyde oxidase
In DepthDetails ArticlePubMed