BDBM50333402 3-{3-[(S)-2-((S)-2-{(S)-2-Amino-3-[(2H-tetrazole-5-carbonyl)-amino]-propionylamino}-3-methyl-butyrylamino)-4-methyl-pentanoylamino]-2-benzyl-2-hydroxy-propionylamino}-benzoic acid::CHEMBL1645504
SMILES CC(C)C[C@H](NC(=O)[C@@H](NC(=O)[C@@H](N)CNC(=O)c1nnn[nH]1)C(C)C)C(=O)NCC(O)(Cc1ccccc1)C(=O)Nc1cccc(c1)C(O)=O
InChI Key InChIKey=OZRARQSFOOEUNQ-IMGUBGMQSA-N
Data  1 IC50
  Tab Delimited (TSV)   2D SDfile   Computed 3D by Vconf -m prep SDfile
Find this compound or compounds like it in BindingDB:
Activity Spreadsheet -- Enzyme Inhibition Constant Data from BindingDB
Found 1 hit for monomerid = 50333402
TargetBeta-secretase 1(Homo sapiens (Human))
Uppsala University
Curated by ChEMBL
LigandPNGBDBM50333402(3-{3-[(S)-2-((S)-2-{(S)-2-Amino-3-[(2H-tetrazole-5...)
Affinity DataIC50:  430nM. Assay description: Inhibition of BACE1
In DepthDetails ArticlePubMed