BDBM50334197 7-Chloro-3-[(imidazolidin-2-yl)imino]indazole hydrochloride::CHEMBL1641689
SMILES Clc1cccc2c(N=C3NCCN3)[nH]nc12
InChI Key InChIKey=IVRZKTAWAHLCMO-UHFFFAOYSA-N
Data  1 KI  1 IC50  1 EC50
  Tab Delimited (TSV)   2D SDfile   Computed 3D by Vconf -m prep SDfile
Find this compound or compounds like it in BindingDB:
Activity Spreadsheet -- Enzyme Inhibition Constant Data from BindingDB
Found 3 hits for monomerid = 50334197
TargetNischarin(RAT)
Medical University Of Gdansk
Curated by ChEMBL
LigandPNGBDBM50334197(7-Chloro-3-[(imidazolidin-2-yl)imino]indazole hydr...)
Affinity DataKi:  30.8nM. Assay description: Displacement of [3H]2BFI from imidazoline I1 receptor in Sprague-Dawley rat brain membrane after 45 mins by liquid scintillation counting
In DepthDetails ArticlePubMed
TargetNischarin(RAT)
Medical University Of Gdansk
Curated by ChEMBL
LigandPNGBDBM50334197(7-Chloro-3-[(imidazolidin-2-yl)imino]indazole hydr...)
Affinity DataIC50:  4.01E+3nM. Assay description: Displacement of [3H]clonidine from imidazoline I1 receptor in Sprague-Dawley rat kidney membrane after 45 mins by liquid scintillation counting
In DepthDetails ArticlePubMed
TargetAlpha-2A adrenergic receptor(Homo sapiens (Human))
Medical University Of Gdansk
Curated by ChEMBL
LigandPNGBDBM50334197(7-Chloro-3-[(imidazolidin-2-yl)imino]indazole hydr...)
Affinity DataEC50:  73nM. Assay description: Agonist activity at human recombinant alpha2A adrenergic receptor expressed in CHO cells assessed as induction of [35S]GTPgammaS binding after 60 min...
In DepthDetails ArticlePubMed