BDBM50334405 10-[3-(4-Fluoro-phenoxy)-azetidin-1-yl]-6,7,8,9-tetrahydro-5H-1,4,7,10a-tetraaza-cyclohepta[f]indene::CHEMBL1643678
SMILES Fc1ccc(OC2CN(C2)c2c3CCNCCc3nc3ccnn23)cc1
InChI Key InChIKey=NQECMVQSEVFPOF-UHFFFAOYSA-N
Data  3 EC50
  Tab Delimited (TSV)   2D SDfile   Computed 3D by Vconf -m prep SDfile
Find this compound or compounds like it in BindingDB:
Activity Spreadsheet -- Enzyme Inhibition Constant Data from BindingDB
Found 3 hits for monomerid = 50334405
Target5-hydroxytryptamine receptor 2C(Homo sapiens (Human))
Evotec
Curated by ChEMBL
LigandPNGBDBM50334405(10-[3-(4-Fluoro-phenoxy)-azetidin-1-yl]-6,7,8,9-te...)
Affinity DataEC50:  23nM. Assay description: Agonist activity at human recombinant 5HT2C receptor expressed in CHOK1 cells assessed as induction of intracellular calcium release by FLIPR assay
In DepthDetails ArticlePubMed
Target5-hydroxytryptamine receptor 2B(Homo sapiens (Human))
Evotec
Curated by ChEMBL
LigandPNGBDBM50334405(10-[3-(4-Fluoro-phenoxy)-azetidin-1-yl]-6,7,8,9-te...)
Affinity DataEC50:  163nM. Assay description: Agonist activity at human recombinant 5HT2B receptor expressed in CHOK1 cells assessed as induction of intracellular calcium release by FLIPR assay
In DepthDetails ArticlePubMed
Target5-hydroxytryptamine receptor 2A(Homo sapiens (Human))
Evotec
Curated by ChEMBL
LigandPNGBDBM50334405(10-[3-(4-Fluoro-phenoxy)-azetidin-1-yl]-6,7,8,9-te...)
Affinity DataEC50:  3nM. Assay description: Agonist activity at human recombinant 5HT2A receptor expressed in CHOK1 cells assessed as induction of intracellular calcium release by FLIPR assay
In DepthDetails ArticlePubMed