BDBM50336595 CHEMBL1672087::tert-butyl 2-{[(1S,5R,13R,14R,17S)-10-hydroxy-4-methyl-17-(3-phenylpropoxy)-12-oxa-4-azapentacyclo[9.6.1.0^{1,13}.0^{5,17}.0^{7,18}]octadeca-7(18),8,10-trien-14-yl]amino}acetate
SMILES CN1CC[C@@]23[C@H]4Oc5c2c(C[C@@H]1[C@@]3(CC[C@H]4NCC(=O)OC(C)(C)C)OCCCc1ccccc1)ccc5O
InChI Key InChIKey=OGJKCDKDZJMBOT-XMCDHTSPSA-N
Data  2 KI
  Tab Delimited (TSV)   2D SDfile   Computed 3D by Vconf -m prep SDfile
Find this compound or compounds like it in BindingDB:
Activity Spreadsheet -- Enzyme Inhibition Constant Data from BindingDB
Found 2 hits for monomerid = 50336595
TargetMu-type opioid receptor(Rattus norvegicus (rat))
University Of Innsbruck
Curated by ChEMBL
LigandPNGBDBM50336595(CHEMBL1672087 | tert-butyl 2-{[(1S,5R,13R,14R,17S)...)
Affinity DataKi:  1nM. Assay description: Displacement of [3H]DAMGO from mu opioid receptor in Sprague-Dawley rat brain membrane by liquid scintillation counting
In DepthDetails ArticlePubMed
TargetDelta-type opioid receptor(Rattus norvegicus (rat))
University Of Innsbruck
Curated by ChEMBL
LigandPNGBDBM50336595(CHEMBL1672087 | tert-butyl 2-{[(1S,5R,13R,14R,17S)...)
Affinity DataKi:  2nM. Assay description: Displacement of [3H][Ile5,6]deltorphin 2 from delta opioid receptor in Sprague-Dawley rat brain membrane by liquid scintillation counting
In DepthDetails ArticlePubMed