BDBM50337001 5-cyclobutyl-2-(difluoromethyl)-3H-pyrano[2,3-d]pyrimidine-4,7-dione::CHEMBL1672734
SMILES FC(F)c1nc2oc(=O)cc(C3CCC3)c2c(=O)[nH]1
InChI Key InChIKey=BZLHDLYMTJNPCY-UHFFFAOYSA-N
Data  1 EC50
  Tab Delimited (TSV)   2D SDfile   Computed 3D by Vconf -m prep SDfile
Find this compound or compounds like it in BindingDB:
Activity Spreadsheet -- Enzyme Inhibition Constant Data from BindingDB
Found 1 hit for monomerid = 50337001
TargetHydroxycarboxylic acid receptor 2(Homo sapiens (Human))
TBA
Curated by ChEMBL
LigandPNGBDBM50337001(5-cyclobutyl-2-(difluoromethyl)-3H-pyrano[2,3-d]py...)
Affinity DataEC50: >1.00E+4nM. Assay description: Agonist activity at human recombinant GPR109a expressed in CHO cells assessed as inhibition of forskolin-stimulated cAMP accumulation
In DepthDetails ArticlePubMed