BDBM50337015 5-ethyl-2-(1-fluoroethyl)-3H-pyrano[2,3-d]pyrimidine-4,7-dione::CHEMBL1672746
SMILES CCc1cc(=O)oc2nc([nH]c(=O)c12)C(C)F
InChI Key InChIKey=AJKUHQWTPIKCLG-UHFFFAOYSA-N
Data  1 EC50
  Tab Delimited (TSV)   2D SDfile   Computed 3D by Vconf -m prep SDfile
Find this compound or compounds like it in BindingDB:
Activity Spreadsheet -- Enzyme Inhibition Constant Data from BindingDB
Found 1 hit for monomerid = 50337015
TargetHydroxycarboxylic acid receptor 2(Homo sapiens (Human))
TBA
Curated by ChEMBL
LigandPNGBDBM50337015(5-ethyl-2-(1-fluoroethyl)-3H-pyrano[2,3-d]pyrimidi...)
Affinity DataEC50:  6.07E+3nM. Assay description: Agonist activity at human recombinant GPR109a expressed in CHO cells assessed as inhibition of forskolin-stimulated cAMP accumulation
In DepthDetails ArticlePubMed