BDBM50337021 2-(chlorofluoromethyl)-5-ethyl-3H-pyrano[2,3-d]pyrimidine-4,7-dione::CHEMBL1672745
SMILES CCc1cc(=O)oc2nc([nH]c(=O)c12)C(F)Cl
InChI Key InChIKey=MXIGPXSKAIBZSP-UHFFFAOYSA-N
Data  1 EC50
  Tab Delimited (TSV)   2D SDfile   Computed 3D by Vconf -m prep SDfile
Find this compound or compounds like it in BindingDB:
Activity Spreadsheet -- Enzyme Inhibition Constant Data from BindingDB
Found 1 hit for monomerid = 50337021
TargetHydroxycarboxylic acid receptor 2(Homo sapiens (Human))
TBA
Curated by ChEMBL
LigandPNGBDBM50337021(2-(chlorofluoromethyl)-5-ethyl-3H-pyrano[2,3-d]pyr...)
Affinity DataEC50:  2.71E+3nM. Assay description: Agonist activity at human recombinant GPR109a expressed in CHO cells assessed as inhibition of forskolin-stimulated cAMP accumulation
In DepthDetails ArticlePubMed