BDBM50337040 2-(difluoromethyl)-5-isopentyl-3H-pyrano[2,3-d]pyrimidine-4,7-dione::CHEMBL1672753
SMILES CC(C)CCc1cc(=O)oc2nc([nH]c(=O)c12)C(F)F
InChI Key InChIKey=FNJBKBBTBBGDEF-UHFFFAOYSA-N
Data  1 EC50
  Tab Delimited (TSV)   2D SDfile   Computed 3D by Vconf -m prep SDfile
Find this compound or compounds like it in BindingDB:
Activity Spreadsheet -- Enzyme Inhibition Constant Data from BindingDB
Found 1 hit for monomerid = 50337040
TargetHydroxycarboxylic acid receptor 2(Homo sapiens (Human))
TBA
Curated by ChEMBL
LigandPNGBDBM50337040(2-(difluoromethyl)-5-isopentyl-3H-pyrano[2,3-d]pyr...)
Affinity DataEC50:  275nM. Assay description: Agonist activity at human recombinant GPR109a expressed in CHO cells assessed as inhibition of forskolin-stimulated cAMP accumulation
In DepthDetails ArticlePubMed