BDBM50339292 5-tert-Butyl-3-(naphthalen-1-yl)-2-(trifluoromethyl)pyrazolo[1,5-a]pyrimidin-7(4H)eone::CHEMBL1689665
SMILES CC(C)(C)c1cc(=O)n2[nH]c(c(-c3cccc4ccccc34)c2n1)C(F)(F)F
InChI Key InChIKey=VLVNRGRJNIRGJA-UHFFFAOYSA-N
Data  1 EC50
  Tab Delimited (TSV)   2D SDfile   Computed 3D by Vconf -m prep SDfile
Find this compound or compounds like it in BindingDB:
Activity Spreadsheet -- Enzyme Inhibition Constant Data from BindingDB
Found 1 hit for monomerid = 50339292
TargetPotassium voltage-gated channel subfamily KQT member 2/3(Homo sapiens (Human))
Hebei Medical University
Curated by ChEMBL
LigandPNGBDBM50339292(5-tert-Butyl-3-(naphthalen-1-yl)-2-(trifluoromethy...)
Affinity DataEC50:  1.93E+4nM. Assay description: Activation of KCNQ2/Q3 expressed in CHO cells by atomic absorption Rb'+ efflux assay
In DepthDetails ArticlePubMed