BDBM50339708 (S)-2-(5-chlorothiophen-2-yl)-N-(1-(5-fluoro-1,2,3,4-tetrahydroisoquinolin-6-yl)-2-oxopyrrolidin-3-yl)ethenesulfonamide::CHEMBL1689022
SMILES Fc1c2CCNCc2ccc1N1CC[C@H](NS(=O)(=O)\C=C\c2ccc(Cl)s2)C1=O
InChI Key InChIKey=AIMHRGMRAPMSTL-VSGCLNPGSA-N
Data  1 KI
  Tab Delimited (TSV)   2D SDfile   Computed 3D by Vconf -m prep SDfile
Find this compound or compounds like it in BindingDB:
Activity Spreadsheet -- Enzyme Inhibition Constant Data from BindingDB
Found 1 hit for monomerid = 50339708
TargetCoagulation factor X(Homo sapiens (Human))
Glaxosmithkline
Curated by ChEMBL
LigandPNGBDBM50339708((S)-2-(5-chlorothiophen-2-yl)-N-(1-(5-fluoro-1,2,3...)
Affinity DataKi:  0.600nM. Assay description: Inhibition of factor 10a using bis-(CBZ-glycylglycly)-L-arginine amide fluorogenic substrate
In DepthDetails ArticlePubMed