BDBM50339788 (S)-2-((2S,3R)-3-amino-2-hydroxy-4-phenylbutanamido)-3-(biphenyl-4-yl)propanoic acid::CHEMBL1689152
SMILES N[C@H](Cc1ccccc1)[C@H](O)C(=O)N[C@@H](Cc1ccc(cc1)-c1ccccc1)C(O)=O
InChI Key InChIKey=GIIIZHAJXKJAQJ-VJBWXMMDSA-N
Data  1 KI
  Tab Delimited (TSV)   2D SDfile   Computed 3D by Vconf -m prep SDfile
Find this compound or compounds like it in BindingDB:
Activity Spreadsheet -- Enzyme Inhibition Constant Data from BindingDB
Found 1 hit for monomerid = 50339788
TargetM1 family aminopeptidase(Plasmodium falciparum (isolate FcB1 / Columbia))
University Of Pennsylvania
Curated by ChEMBL
LigandPNGBDBM50339788((S)-2-((2S,3R)-3-amino-2-hydroxy-4-phenylbutanamid...)
Affinity DataKi: >1.50E+4nM. Assay description: Inhibition of Plasmodium falciparum recombinant M1-aminopeptidase expressed in Escherichia coli after 40 mins uisng fluorigenic substrate L-Leucyl-7-...
In DepthDetails ArticlePubMed