BDBM50340470 (1S,3aS,3bS,9aR,9bS,11aS)-1-((4R,5R)-4,5-diphenyl-4,5-dihydrooxazol-2-yl)-9a,11a-dimethyl-3,3a,3b,4,5,8,9,9a,9b,10,11,11a-dodecahydro-1H-cyclopenta[i]phenanthridin-7(2H)-one::CHEMBL1762027
SMILES C[C@]12CC[C@H]3[C@@H](CN=C4CC(=O)CC[C@]34C)[C@@H]1CC[C@@H]2C1=N[C@@H]([C@H](O1)c1ccccc1)c1ccccc1
InChI Key InChIKey=CCLYJYJMKZNPGT-JXAWRAAJSA-N
Data  1 IC50
  Tab Delimited (TSV)   2D SDfile   Computed 3D by Vconf -m prep SDfile
Find this compound or compounds like it in BindingDB:
Activity Spreadsheet -- Enzyme Inhibition Constant Data from BindingDB
Found 1 hit for monomerid = 50340470
Target3 beta-hydroxysteroid dehydrogenase/Delta 5-->4-isomerase(Mycobacterium tuberculosis)
Stony Brook University
Curated by ChEMBL
LigandPNGBDBM50340470((1S,3aS,3bS,9aR,9bS,11aS)-1-((4R,5R)-4,5-diphenyl-...)
Affinity DataIC50:  9.00E+3nM. Assay description: Inhibition of Mycobacterium tuberculosis 3 beta hydroxysteriod dehydrogenase
In DepthDetails ArticlePubMed