BDBM50340796 CHEMBL1760687::N-(4-(5-(1-(4-chlorophenyl)cyclobutyl)-4-methyl-4H-1,2,4-triazol-3-yl)phenyl)isoxazole-5-carboxamide
SMILES Cn1c(nnc1C1(CCC1)c1ccc(Cl)cc1)-c1ccc(NC(=O)c2ccno2)cc1
InChI Key InChIKey=GYGISWPQEUFTKD-UHFFFAOYSA-N
Data  4 IC50  1 EC50
  Tab Delimited (TSV)   2D SDfile   Computed 3D by Vconf -m prep SDfile
Find this compound or compounds like it in BindingDB:
Activity Spreadsheet -- Enzyme Inhibition Constant Data from BindingDB
Found 5 hits for monomerid = 50340796
Target11-beta-hydroxysteroid dehydrogenase 1(Homo sapiens (Human))
Merck
Curated by ChEMBL
LigandPNGBDBM50340796(CHEMBL1760687 | N-(4-(5-(1-(4-chlorophenyl)cyclobu...)
Affinity DataIC50:  8nM. Assay description: Inhibition of human 11beta-HSD1 expressed in CHO-K1 cells assessed as conversion of [3H]cortisone to [3H]cortisol by scintillation counting
In DepthDetails ArticlePubMed
Target11-beta-hydroxysteroid dehydrogenase 1(Mus musculus (mouse))
Merck
Curated by ChEMBL
LigandPNGBDBM50340796(CHEMBL1760687 | N-(4-(5-(1-(4-chlorophenyl)cyclobu...)
Affinity DataIC50:  2.80nM. Assay description: Inhibition of mouse 11beta-HSD1 expressed in CHO-K1 cells assessed as conversion of [3H]cortisone to [3H]cortisol by scintillation counting
In DepthDetails ArticlePubMed
Target11-beta-hydroxysteroid dehydrogenase type 2(Mus musculus (mouse))
Merck
Curated by ChEMBL
LigandPNGBDBM50340796(CHEMBL1760687 | N-(4-(5-(1-(4-chlorophenyl)cyclobu...)
Affinity DataIC50: >4.00E+3nM. Assay description: Inhibition of mouse 11beta-HSD2
In DepthDetails ArticlePubMed
Target11-beta-hydroxysteroid dehydrogenase type 2(Homo sapiens (Human))
Merck
Curated by ChEMBL
LigandPNGBDBM50340796(CHEMBL1760687 | N-(4-(5-(1-(4-chlorophenyl)cyclobu...)
Affinity DataIC50: >4.00E+3nM. Assay description: Inhibition of human 11beta-HSD2
In DepthDetails ArticlePubMed
TargetNuclear receptor subfamily 1 group I member 2(Homo sapiens (Human))
Merck
Curated by ChEMBL
LigandPNGBDBM50340796(CHEMBL1760687 | N-(4-(5-(1-(4-chlorophenyl)cyclobu...)
Affinity DataEC50: >3.00E+4nM. Assay description: Agonist activity at PXR
In DepthDetails ArticlePubMed