BDBM50342070 (S)-2-(6-(benzyloxy)-1,2,3,4-tetrahydronaphthalene-2-carbonyl)oxazole-5-carbonitrile::CHEMBL1765836
SMILES O=C([C@H]1CCc2cc(OCc3ccccc3)ccc2C1)c1ncc(o1)C#N
InChI Key InChIKey=MGLKICUYHKUUSH-SFHVURJKSA-N
Data  1 KI
  Tab Delimited (TSV)   2D SDfile   Computed 3D by Vconf -m prep SDfile
Find this compound or compounds like it in BindingDB:
Activity Spreadsheet -- Enzyme Inhibition Constant Data from BindingDB
Found 1 hit for monomerid = 50342070
TargetFatty-acid amide hydrolase 1(Homo sapiens (Human))
The Scripps Research Institute
Curated by ChEMBL
LigandPNGBDBM50342070((S)-2-(6-(benzyloxy)-1,2,3,4-tetrahydronaphthalene...)
Affinity DataKi:  3.20nM. Assay description: Inhibition of full-length human FAAH expressed in COS-7 cells assessed as [14C]-labeled oleamide to oleic acid conversion
In DepthDetails ArticlePubMed