BDBM50342105 (S)-methyl 6-(2-(5-(benzyloxy)-2,3-dihydro-1H-indene-2-carbonyl)oxazol-5-yl)picolinate::CHEMBL1765871
SMILES COC(=O)c1cccc(n1)-c1cnc(o1)C(=O)[C@H]1Cc2ccc(OCc3ccccc3)cc2C1
InChI Key InChIKey=CCSBVUOWRVQOEF-FQEVSTJZSA-N
Data  2 KI
  Tab Delimited (TSV)   2D SDfile   Computed 3D by Vconf -m prep SDfile
Find this compound or compounds like it in BindingDB:
Activity Spreadsheet -- Enzyme Inhibition Constant Data from BindingDB
Found 2 hits for monomerid = 50342105
TargetFatty-acid amide hydrolase 1(Homo sapiens (Human))
The Scripps Research Institute
Curated by ChEMBL
LigandPNGBDBM50342105((S)-methyl 6-(2-(5-(benzyloxy)-2,3-dihydro-1H-inde...)
Affinity DataKi:  5.80nM. Assay description: Inhibition of full-length human FAAH expressed in COS-7 cells assessed as [14C]-labeled oleamide to oleic acid conversion
In DepthDetails ArticlePubMed
TargetFatty-acid amide hydrolase 1(Homo sapiens (Human))
The Scripps Research Institute
Curated by ChEMBL
LigandPNGBDBM50342105((S)-methyl 6-(2-(5-(benzyloxy)-2,3-dihydro-1H-inde...)
Affinity DataKi: >1.00E+4nM. Assay description: Inhibition of full-length human FAAH expressed in COS-7 cells assessed as [14C]-labeled oleamide to oleic acid conversion
In DepthDetails ArticlePubMed