BDBM50342118 (S)-(6-phenoxy-1,2,3,4-tetrahydronaphthalen-2-yl)(5-(pyridin-2-yl)-1,3,4-oxadiazol-2-yl)methanone::CHEMBL1765984
SMILES O=C([C@H]1CCc2cc(Oc3ccccc3)ccc2C1)c1nnc(o1)-c1ccccn1
InChI Key InChIKey=HLMNHEOLJAXWIH-SFHVURJKSA-N
Data  1 KI
  Tab Delimited (TSV)   2D SDfile   Computed 3D by Vconf -m prep SDfile
Find this compound or compounds like it in BindingDB:
Activity Spreadsheet -- Enzyme Inhibition Constant Data from BindingDB
Found 1 hit for monomerid = 50342118
TargetFatty-acid amide hydrolase 1(Homo sapiens (Human))
The Scripps Research Institute
Curated by ChEMBL
LigandPNGBDBM50342118((S)-(6-phenoxy-1,2,3,4-tetrahydronaphthalen-2-yl)(...)
Affinity DataKi:  1nM. Assay description: Inhibition of full-length human FAAH expressed in COS-7 cells assessed as [14C]-labeled oleamide to oleic acid conversion
In DepthDetails ArticlePubMed