BDBM50342425 CHEMBL1771638::Propyl fumarate
SMILES CCCOC(=O)\C=C\C(O)=O
InChI Key InChIKey=AYAUWVRAUCDBFR-ONEGZZNKSA-N
Data  1 KI
  Tab Delimited (TSV)   2D SDfile   Computed 3D by Vconf -m prep SDfile
Find this compound or compounds like it in BindingDB:
Activity Spreadsheet -- Enzyme Inhibition Constant Data from BindingDB
Found 1 hit for monomerid = 50342425
TargetHydroxycarboxylic acid receptor 2(Homo sapiens (Human))
Leiden University
Curated by ChEMBL
LigandPNGBDBM50342425(CHEMBL1771638 | Propyl fumarate)
Affinity DataKi:  1.00E+3nM. Assay description: Displacement of [3H]nicotinic acid from human GPR109a receptor expressed in human HEK293T cells by liquid scintillation counting
In DepthDetails ArticlePubMed