BDBM50343274 7-(4-(4-(5,6,7,8-tetrahydronaphthalen-1-yl)piperazin-1-yl)butoxy)-3,4-dihydro-1,8-naphthyridin-2(1H)-one::CHEMBL1774077
SMILES O=C1CCc2ccc(OCCCCN3CCN(CC3)c3cccc4CCCCc34)nc2N1
InChI Key InChIKey=VMYDRWOVWUPFPO-UHFFFAOYSA-N
Data  3 KI
  Tab Delimited (TSV)   2D SDfile   Computed 3D by Vconf -m prep SDfile
Find this compound or compounds like it in BindingDB:
Activity Spreadsheet -- Enzyme Inhibition Constant Data from BindingDB
Found 3 hits for monomerid = 50343274
Target5-hydroxytryptamine receptor 2A(Homo sapiens (Human))
Pfizer
Curated by ChEMBL
LigandPNGBDBM50343274(7-(4-(4-(5,6,7,8-tetrahydronaphthalen-1-yl)piperaz...)
Affinity DataKi:  0.0900nM. Assay description: Binding affinity to human 5HT2A receptor
In DepthDetails ArticlePubMed
TargetD(2) dopamine receptor(Homo sapiens (Human))
Pfizer
Curated by ChEMBL
LigandPNGBDBM50343274(7-(4-(4-(5,6,7,8-tetrahydronaphthalen-1-yl)piperaz...)
Affinity DataKi:  1.40nM. Assay description: Displacement of [3H]Spiperone from human dopamine D2L receptor expressed in CHO cells
In DepthDetails ArticlePubMed
Target5-hydroxytryptamine receptor 1A(Homo sapiens (Human))
Pfizer
Curated by ChEMBL
LigandPNGBDBM50343274(7-(4-(4-(5,6,7,8-tetrahydronaphthalen-1-yl)piperaz...)
Affinity DataKi:  28nM. Assay description: Displacement of [3H]-8-OH-DPAT from human 5HT1A receptor expressed in HeLa cells
In DepthDetails ArticlePubMed