BDBM50344963 1-Methylpyrenyl mercapturic acid::CHEMBL1778337
SMILES CC(=O)NC(CSCC1=CC=C2C=Cc3cccc4CC=C1C2c34)C(O)=O
InChI Key InChIKey=YSISPQXLVACETJ-UHFFFAOYSA-N
Data  1 KI
  Tab Delimited (TSV)   2D SDfile   Computed 3D by Vconf -m prep SDfile
Find this compound or compounds like it in BindingDB:
Activity Spreadsheet -- Enzyme Inhibition Constant Data from BindingDB
Found 1 hit for monomerid = 50344963
TargetSolute carrier family 22 member 6(Homo sapiens (Human))
University Of California
Curated by ChEMBL
LigandPNGBDBM50344963(1-Methylpyrenyl mercapturic acid | CHEMBL1778337)
Affinity DataKi:  1.45E+4nM. Assay description: Inhibition of human Oat1 expressed in HEK293 cells
In DepthDetails ArticlePubMed