BDBM50347450 CHEMBL1802194
SMILES COC(=O)c1ccc(cc1)-c1ccc(Cl)c(O[C@H]2O[C@H](CO)[C@@H](O)[C@H](O)[C@@H]2O)c1
InChI Key InChIKey=WDDBPKRIAIETTE-JGLNRKDHSA-N
Data  2 IC50
  Tab Delimited (TSV)   2D SDfile   Computed 3D by Vconf -m prep SDfile
Find this compound or compounds like it in BindingDB:
Activity Spreadsheet -- Enzyme Inhibition Constant Data from BindingDB
Found 2 hits for monomerid = 50347450
TargetType 1 fimbiral adhesin FimH(Escherichia coli (strain UTI89 / UPEC))
University Of Basel
Curated by ChEMBL
LigandPNGBDBM50347450(CHEMBL1802194)
Affinity DataIC50:  3.10E+4nM. Assay description: Antagonist activity at Escherichia coli UT189 FimH in guinea pig red blood cells assessed as disaggregation of bacteria after 600 secs by aggregometr...
In DepthDetails ArticlePubMed
TargetType 1 fimbrin D-mannose specific adhesin(Escherichia coli (strain K12))
University Of Basel
Curated by ChEMBL
LigandPNGBDBM50347450(CHEMBL1802194)
Affinity DataIC50:  11.8nM. Assay description: Competitive inhibition of His-tagged FimH carbohydrate recognizing domain expressed in Escherichia coli HM125 using ABTS-substrate after 3 hrs by cal...
In DepthDetails ArticlePubMed