BDBM50350795 CHEMBL1819129
SMILES COc1cc2ncnc(N3CCCC(C3)c3ccccc3)c2cc1OCCc1cccnc1
InChI Key InChIKey=FKIOLIIYIFDDCW-UHFFFAOYSA-N
Data  1 IC50
  Tab Delimited (TSV)   2D SDfile   Computed 3D by Vconf -m prep SDfile
Find this compound or compounds like it in BindingDB:
Activity Spreadsheet -- Enzyme Inhibition Constant Data from BindingDB
Found 1 hit for monomerid = 50350795
TargetcAMP and cAMP-inhibited cGMP 3',5'-cyclic phosphodiesterase 10A(Rattus norvegicus (rat))
Pfizer
Curated by ChEMBL
LigandPNGBDBM50350795(CHEMBL1819129)
Affinity DataIC50:  2.34E+3nM. Assay description: Inhibition of recombinant rat PDE10A expressed in Sf9 cells using [3H]cAMP after 30 mins by scintillation proximity assay
In DepthDetails ArticlePubMed