BDBM50350971 CHEMBL1818232
SMILES CC(C)(C)CCNCc1ccc(cc1)-c1cccnc1S(=O)(=O)N1CCCC1
InChI Key InChIKey=OZDYNHVVZWVNHC-UHFFFAOYSA-N
Data  2 KI
  Tab Delimited (TSV)   2D SDfile   Computed 3D by Vconf -m prep SDfile
Find this compound or compounds like it in BindingDB:
Activity Spreadsheet -- Enzyme Inhibition Constant Data from BindingDB
Found 2 hits for monomerid = 50350971
TargetKappa-type opioid receptor(Homo sapiens (Human))
Pfizer
Curated by ChEMBL
LigandPNGBDBM50350971(CHEMBL1818232)
Affinity DataKi:  8.40nM. Assay description: Displacement of [3H]diprenorphine from human kappa opioid receptor expressed in CHO cells after 1 hr by liquid scintillation counting
In DepthDetails ArticlePubMed
TargetMu-type opioid receptor(Homo sapiens (Human))
Pfizer
Curated by ChEMBL
LigandPNGBDBM50350971(CHEMBL1818232)
Affinity DataKi:  39nM. Assay description: Displacement of [3H]diprenorphine from human mu opioid receptor expressed in CHO cells after 1 hr by liquid scintillation counting
In DepthDetails ArticlePubMed