BDBM50351922 CHEMBL1821813
SMILES Nc1nc2ccccc2cc1CCC(=O)NCC1CCCCC1
InChI Key InChIKey=YOUIXYWUUXULRM-UHFFFAOYSA-N
Data  1 Kd
PDB links: 1 PDB ID matches this monomer.
  Tab Delimited (TSV)   2D SDfile   Computed 3D by Vconf -m prep SDfile
Find this compound or compounds like it in BindingDB:
Activity Spreadsheet -- Enzyme Inhibition Constant Data from BindingDB
Found 1 hit for monomerid = 50351922
TargetBeta-secretase 1(Homo sapiens (Human))
Amgen
Curated by ChEMBL
LigandPNGBDBM50351922(CHEMBL1821813)
Affinity DataKd:  1.42E+4nM. Assay description: Binding affinity to BACE1 after 90 seconds by surface plasmon resonance assay