BDBM50352551 CHEMBL1821759
SMILES CC(C)n1cc(cn1)-c1cnc(N)c(OC(C)c2c(Cl)ccc(F)c2Cl)c1
InChI Key InChIKey=JHPYCETZLQWNOY-UHFFFAOYSA-N
Data  1 KI  1 IC50
  Tab Delimited (TSV)   2D SDfile   Computed 3D by Vconf -m prep SDfile
Find this compound or compounds like it in BindingDB:
Activity Spreadsheet -- Enzyme Inhibition Constant Data from BindingDB
Found 2 hits for monomerid = 50352551
TargetHepatocyte growth factor receptor(Homo sapiens (Human))
Pfizer
Curated by ChEMBL
LigandPNGBDBM50352551(CHEMBL1821759)
Affinity DataKi:  37nM. Assay description: Binding affinity to human recombinant c-MET assessed as inhibition of autophosphorylation by continuous fluorometric assay
In DepthDetails ArticlePubMed
TargetHepatocyte growth factor receptor(Homo sapiens (Human))
Pfizer
Curated by ChEMBL
LigandPNGBDBM50352551(CHEMBL1821759)
Affinity DataIC50:  36nM. Assay description: Inhibition of human recombinant c-MET kinase expressed in A549 cells assessed as inhibition of HGF-induced autophosphorylation by ELISA method
In DepthDetails ArticlePubMed