BDBM50353760 CHEMBL1829248
SMILES CCC(N(CCCN)C(=O)c1ccc(C)cc1)c1nc2ccsc2c(=O)n1Cc1cccc(F)c1
InChI Key InChIKey=ZDDJSBGQRXQJAK-UHFFFAOYSA-N
Data  1 IC50
  Tab Delimited (TSV)   2D SDfile   Computed 3D by Vconf -m prep SDfile
Find this compound or compounds like it in BindingDB:
Activity Spreadsheet -- Enzyme Inhibition Constant Data from BindingDB
Found 1 hit for monomerid = 50353760
TargetKinesin-like protein KIF11(Homo sapiens (Human))
Astrazeneca
Curated by ChEMBL
LigandPNGBDBM50353760(CHEMBL1829248)
Affinity DataIC50:  20nM. Assay description: Inhibition of human recombinant C-terminal His6-tagged KSP ATPase activity after 1 hr by malachite green assay
In DepthDetails ArticlePubMed