BDBM50353785 CHEMBL1829428
SMILES CCC(N(CCCN)C(=O)c1ccc(C)cc1)c1nc2ncccc2c(=O)n1Cc1ccccc1
InChI Key InChIKey=HOVNDQICBBHRRQ-UHFFFAOYSA-N
Data  1 IC50
  Tab Delimited (TSV)   2D SDfile   Computed 3D by Vconf -m prep SDfile
Find this compound or compounds like it in BindingDB:
Activity Spreadsheet -- Enzyme Inhibition Constant Data from BindingDB
Found 1 hit for monomerid = 50353785
TargetKinesin-like protein KIF11(Homo sapiens (Human))
Astrazeneca
Curated by ChEMBL
LigandPNGBDBM50353785(CHEMBL1829428)
Affinity DataIC50:  323nM. Assay description: Inhibition of human recombinant C-terminal His6-tagged KSP ATPase activity after 1 hr by malachite green assay
In DepthDetails ArticlePubMed