BDBM50354102 CHEMBL1836107
SMILES O=C(NC1C[C@H]2CC[C@H](C1)N2Cc1ccccc1)c1ccc2ccccc2c1
InChI Key InChIKey=SZQSNCKURPPYDK-DNQXCXABSA-N
Data  3 KI
  Tab Delimited (TSV)   2D SDfile   Computed 3D by Vconf -m prep SDfile
Find this compound or compounds like it in BindingDB:
Activity Spreadsheet -- Enzyme Inhibition Constant Data from BindingDB
Found 3 hits for monomerid = 50354102
Target5-hydroxytryptamine receptor 2A(Rattus norvegicus (rat))
Medical University Of Warsaw
Curated by ChEMBL
LigandPNGBDBM50354102(CHEMBL1836107)
Affinity DataKi:  2.5nM. Assay description: Displacement of [3H]ketanserin from 5HT2A in rat brain cerebral cortex after 20 mins by scintillation counting
In DepthDetails ArticlePubMed
TargetD(2) dopamine receptor(Rattus norvegicus (rat))
Medical University Of Warsaw
Curated by ChEMBL
LigandPNGBDBM50354102(CHEMBL1836107)
Affinity DataKi:  82.4nM. Assay description: Displacement of [3H]spiperone from dopamine D2 receptor in rat straitum tissue after 20 mins by scintillation counting
In DepthDetails ArticlePubMed
Target5-hydroxytryptamine receptor 1A(Rattus norvegicus (rat))
Medical University Of Warsaw
Curated by ChEMBL
LigandPNGBDBM50354102(CHEMBL1836107)
Affinity DataKi:  304nM. Assay description: Displacement of [3H]8OH-DPAT from 5HT1A in rat brain cerebral cortex after 15 mins by scintillation counting
In DepthDetails ArticlePubMed