BDBM50355949 CHEMBL1910418
SMILES CCS[C@H]1C[C@H](Nc2ccc(cc12)[N+]([O-])=O)C(C)(C)CO
InChI Key InChIKey=XCFFOWBCOFEAKL-KBPBESRZSA-N
Data  2 IC50  1 EC50
  Tab Delimited (TSV)   2D SDfile   Computed 3D by Vconf -m prep SDfile
Find this compound or compounds like it in BindingDB:
Activity Spreadsheet -- Enzyme Inhibition Constant Data from BindingDB
Found 3 hits for monomerid = 50355949
TargetAndrogen receptor(Rattus norvegicus (Rat))
Kaken Pharmaceutical
Curated by ChEMBL
LigandPNGBDBM50355949(CHEMBL1910418)
Affinity DataIC50:  22nM. Assay description: Competitive binding affinity to rat androgen receptorChecked by Author
In DepthDetails ArticlePubMed
TargetAndrogen receptor(Rattus norvegicus (Rat))
Kaken Pharmaceutical
Curated by ChEMBL
LigandPNGBDBM50355949(CHEMBL1910418)
Affinity DataIC50:  2.90E+4nM. Assay description: Antagonist activity at rat androgen receptorChecked by Author
In DepthDetails ArticlePubMed
TargetAndrogen receptor(Rattus norvegicus (Rat))
Kaken Pharmaceutical
Curated by ChEMBL
LigandPNGBDBM50355949(CHEMBL1910418)
Affinity DataEC50:  75nM. Assay description: Agonist activity at rat androgen receptorChecked by Author
In DepthDetails ArticlePubMed